Inference Revenue
type: Concept
alternative label: PKG6-IR
definition: Inference revenue is revenue earned from run-time AI inference consumption - tokens, API calls, or compute - evaluated for recognition under ASC 606 and IFRS 15.
related: AI Revenue Recognition
related: Token-based Consumption
related: Revenue per Inference
modified: 2026-06-16